BDBM50161738 4-fluorobenzaldehyde O-benzoyloxime::CHEMBL180720
SMILES Fc1ccc(\C=N\OC(=O)c2ccccc2)cc1
InChI Key InChIKey=DIEBAKUPBFEXAP-MHWRWJLKSA-N
Data  2 IC50
  Tab Delimited (TSV)   2D SDfile   Computed 3D by Vconf -m prep SDfile
Find this compound or compounds like it in BindingDB:
Activity Spreadsheet -- Enzyme Inhibition Constant Data from BindingDB
Found 2 hits for monomerid = 50161738
TargetPlatelet-activating factor acetylhydrolase(Homo sapiens (Human))
National Research Laboratory Of Lipid Metabolism And Atherosclerosis
Curated by ChEMBL
LigandPNGBDBM50161738(4-fluorobenzaldehyde O-benzoyloxime | CHEMBL180720)
Affinity DataIC50:  4.40E+3nM. Assay description: Inhibition of human Low density lipoprotein-associated phospholipase A2
In DepthDetails ArticlePubMed
TargetPlatelet-activating factor acetylhydrolase(Homo sapiens (Human))
National Research Laboratory Of Lipid Metabolism And Atherosclerosis
Curated by ChEMBL
LigandPNGBDBM50161738(4-fluorobenzaldehyde O-benzoyloxime | CHEMBL180720)
Affinity DataIC50:  4.40E+3nM. Assay description: In vitro inhibitory activity against human lipoprotein-associated phospholiphase A2
In DepthDetails ArticlePubMed