BDBM50161741 (E)-(thiophen-2-ylmethylidene)amino benzoate::CHEMBL362066
SMILES O=C(O\N=C\c1cccs1)c1ccccc1
InChI Key InChIKey=VRGHYBJYCUKCSY-UKTHLTGXSA-N
Data  1 IC50
  Tab Delimited (TSV)   2D SDfile   Computed 3D by Vconf -m prep SDfile
Find this compound or compounds like it in BindingDB:
Activity Spreadsheet -- Enzyme Inhibition Constant Data from BindingDB
Found 1 hit for monomerid = 50161741
TargetPlatelet-activating factor acetylhydrolase(Homo sapiens (Human))
National Research Laboratory Of Lipid Metabolism And Atherosclerosis
Curated by ChEMBL
LigandPNGBDBM50161741((E)-(thiophen-2-ylmethylidene)amino benzoate | CHE...)
Affinity DataIC50:  1.12E+4nM. Assay description: In vitro inhibitory activity against human lipoprotein-associated phospholiphase A2
In DepthDetails ArticlePubMed