BDBM50161830 CHEMBL3793439
SMILES ONC(=O)[C@]1(F)[C@@H]([C@H]1c1ccc(cc1)-c1cnco1)c1ccccc1
InChI Key InChIKey=TUZLRTHLFZOEMM-LMMKCTJWSA-N
Data  1 IC50
  Tab Delimited (TSV)   2D SDfile   Computed 3D by Vconf -m prep SDfile
Find this compound or compounds like it in BindingDB:
Activity Spreadsheet -- Enzyme Inhibition Constant Data from BindingDB
Found 1 hit for monomerid = 50161830
TargetHistone deacetylase 4(Homo sapiens (Human))
Biofocus
Curated by ChEMBL
LigandPNGBDBM50161830(CHEMBL3793439)
Affinity DataIC50:  10nM. Assay description: Inhibition of HDAC4 catalytic domain (unknown origin) using Boc-Lys(TFA)-AMC as substrate
In DepthDetails ArticlePubMed