BDBM50161834 CHEMBL3794175
SMILES COc1ccc(cc1OC)C(C)(C)c1cnc(SCc2c(F)cccc2Cl)n1-c1ccc(F)cc1
InChI Key InChIKey=NGCFQZZMKMQQAL-UHFFFAOYSA-N
Data  2 EC50
  Tab Delimited (TSV)   2D SDfile   Computed 3D by Vconf -m prep SDfile
Find this compound or compounds like it in BindingDB:
Activity Spreadsheet -- Enzyme Inhibition Constant Data from BindingDB
Found 2 hits for monomerid = 50161834
TargetG-protein coupled bile acid receptor 1(Homo sapiens (Human))
Cadila Healthcare
Curated by ChEMBL
LigandPNGBDBM50161834(CHEMBL3794175)
Affinity DataEC50:  17nM. Assay description: Agonist activity at human TGR5 expressed in CHOK1 cells after 5 hrs by luciferase reporter gene assay
In DepthDetails ArticlePubMed
TargetG-protein coupled bile acid receptor 1(Homo sapiens (Human))
Cadila Healthcare
Curated by ChEMBL
LigandPNGBDBM50161834(CHEMBL3794175)
Affinity DataEC50:  17nM. Assay description: Agonist activity at human TGR5 expressed in CHO-K1 cells after 5 hrs by luciferase reporter gene assay
In DepthDetails ArticlePubMed