BDBM50161981 CHEMBL3793872
SMILES Clc1ccc(cc1)-c1ccc2C(=O)NC(=O)Cc2c1
InChI Key InChIKey=BEGONPMARCFCSU-UHFFFAOYSA-N
Data  2 IC50
  Tab Delimited (TSV)   2D SDfile   Computed 3D by Vconf -m prep SDfile
Find this compound or compounds like it in BindingDB:
Activity Spreadsheet -- Enzyme Inhibition Constant Data from BindingDB
Found 2 hits for monomerid = 50161981
TargetTyrosyl-DNA phosphodiesterase 2(Homo sapiens (Human))
University Of Minnesota
Curated by ChEMBL
LigandPNGBDBM50161981(CHEMBL3793872)
Affinity DataIC50:  6.40E+3nM. Assay description: Inhibition of recombinant human TDP2 using 18-mer single stranded oligonucleotide DNA as substrate incubated for 15 mins by PAGE assay
In DepthDetails ArticlePubMed
TargetTyrosyl-DNA phosphodiesterase 2(Homo sapiens (Human))
University Of Minnesota
Curated by ChEMBL
LigandPNGBDBM50161981(CHEMBL3793872)
Affinity DataIC50:  6.40E+3nM. Assay description: Inhibition of recombinant human TDP2 using 18-mer single stranded oligonucleotide DNA as substrate incubated for 15 mins by PAGE assay
In DepthDetails ArticlePubMed