BDBM50161992 CHEMBL3794329
SMILES O=C1Cc2ccc(cc2C(=O)N1)-c1ccco1
InChI Key InChIKey=OBZQJZPXHZQQHT-UHFFFAOYSA-N
Data  2 IC50
  Tab Delimited (TSV)   2D SDfile   Computed 3D by Vconf -m prep SDfile
Find this compound or compounds like it in BindingDB:
Activity Spreadsheet -- Enzyme Inhibition Constant Data from BindingDB
Found 2 hits for monomerid = 50161992
TargetTyrosyl-DNA phosphodiesterase 2(Homo sapiens (Human))
University Of Minnesota
Curated by ChEMBL
LigandPNGBDBM50161992(CHEMBL3794329)
Affinity DataIC50:  5.00E+4nM. Assay description: Inhibition of human TDP2 expressed in DT40 cells (TDP2-knockout) using 18-mer single stranded oligonucleotide DNA as substrate incubated for 15 mins ...
In DepthDetails ArticlePubMed
TargetTyrosyl-DNA phosphodiesterase 2(Homo sapiens (Human))
University Of Minnesota
Curated by ChEMBL
LigandPNGBDBM50161992(CHEMBL3794329)
Affinity DataIC50:  1.30E+4nM. Assay description: Inhibition of recombinant human TDP2 using 18-mer single stranded oligonucleotide DNA as substrate incubated for 15 mins by PAGE assay
In DepthDetails ArticlePubMed