BDBM50162001 3-((R)-2-Amino-2-phenyl-ethyl)-5-(2-fluoro-phenyl)-6-methyl-1-pyridin-3-ylmethyl-1H-pyrimidine-2,4-dione::CHEMBL360056
SMILES Cc1c(-c2ccccc2F)c(=O)n(C[C@H](N)c2ccccc2)c(=O)n1Cc1cccnc1
InChI Key InChIKey=DPOCVWWPONMZDU-QFIPXVFZSA-N
Data  1 KI
  Tab Delimited (TSV)   2D SDfile   Computed 3D by Vconf -m prep SDfile
Find this compound or compounds like it in BindingDB:
Activity Spreadsheet -- Enzyme Inhibition Constant Data from BindingDB
Found 1 hit for monomerid = 50162001
TargetGonadotropin-releasing hormone receptor(Homo sapiens (Human))
Neurocrine Biosciences
Curated by ChEMBL
LigandPNGBDBM50162001(3-((R)-2-Amino-2-phenyl-ethyl)-5-(2-fluoro-phenyl)...)
Affinity DataKi:  980nM. Assay description: Binding affinity for Human gonadotropin-releasing hormone receptor
In DepthDetails ArticlePubMed