BDBM50162016 3-((R)-2-Amino-2-phenyl-ethyl)-1-(2,6-difluoro-benzyl)-6-methyl-5-(4-methylsulfanyl-phenyl)-1H-pyrimidine-2,4-dione::CHEMBL179460
SMILES CSc1ccc(cc1)-c1c(C)n(Cc2c(F)cccc2F)c(=O)n(C[C@H](N)c2ccccc2)c1=O
InChI Key InChIKey=SFKSQGMDOMSIRP-DEOSSOPVSA-N
Data  1 KI
  Tab Delimited (TSV)   2D SDfile   Computed 3D by Vconf -m prep SDfile
Find this compound or compounds like it in BindingDB:
Activity Spreadsheet -- Enzyme Inhibition Constant Data from BindingDB
Found 1 hit for monomerid = 50162016
TargetGonadotropin-releasing hormone receptor(Homo sapiens (Human))
Neurocrine Biosciences
Curated by ChEMBL
LigandPNGBDBM50162016(3-((R)-2-Amino-2-phenyl-ethyl)-1-(2,6-difluoro-ben...)
Affinity DataKi:  13nM. Assay description: Binding affinity for Human gonadotropin-releasing hormone receptor
In DepthDetails ArticlePubMed