BDBM50162018 3-((R)-2-Amino-2-phenyl-ethyl)-5-(2-fluoro-phenyl)-1-(2-methoxy-benzyl)-6-methyl-1H-pyrimidine-2,4-dione::CHEMBL366865
SMILES COc1ccccc1Cn1c(C)c(-c2ccccc2F)c(=O)n(C[C@H](N)c2ccccc2)c1=O
InChI Key InChIKey=LUSVRJUVWGOGKU-QHCPKHFHSA-N
Data  1 KI
  Tab Delimited (TSV)   2D SDfile   Computed 3D by Vconf -m prep SDfile
Find this compound or compounds like it in BindingDB:
Activity Spreadsheet -- Enzyme Inhibition Constant Data from BindingDB
Found 1 hit for monomerid = 50162018
TargetGonadotropin-releasing hormone receptor(Homo sapiens (Human))
Neurocrine Biosciences
Curated by ChEMBL
LigandPNGBDBM50162018(3-((R)-2-Amino-2-phenyl-ethyl)-5-(2-fluoro-phenyl)...)
Affinity DataKi:  100nM. Assay description: Binding affinity for Human gonadotropin-releasing hormone receptor
In DepthDetails ArticlePubMed