BDBM50162052 CHEMBL3794550
SMILES C=CC(=O)Nc1cccc(c1)-c1ccc2CC(=O)NC(=O)c2c1
InChI Key InChIKey=AONSSEGVBNBUJM-UHFFFAOYSA-N
Data  1 IC50
  Tab Delimited (TSV)   2D SDfile   Computed 3D by Vconf -m prep SDfile
Find this compound or compounds like it in BindingDB:
Activity Spreadsheet -- Enzyme Inhibition Constant Data from BindingDB
Found 1 hit for monomerid = 50162052
TargetTyrosyl-DNA phosphodiesterase 2(Homo sapiens (Human))
University Of Minnesota
Curated by ChEMBL
LigandPNGBDBM50162052(CHEMBL3794550)
Affinity DataIC50:  1.10E+4nM. Assay description: Inhibition of recombinant human TDP2 using 18-mer single stranded oligonucleotide DNA as substrate incubated for 15 mins by PAGE assay
In DepthDetails ArticlePubMed