BDBM50162411 CHEMBL194161::[2-(4-tert-Butyl-phenyl)-2-(4-cyclohexyl-piperazin-1-yl)-ethyl]-[2-(4-methoxy-phenyl)-ethyl]-amine
SMILES COc1ccc(CCNCC(N2CCN(CC2)C2CCCCC2)c2ccc(cc2)C(C)(C)C)cc1
InChI Key InChIKey=FDSAKRKDLPNMLT-UHFFFAOYSA-N
Data  1 KI
  Tab Delimited (TSV)   2D SDfile   Computed 3D by Vconf -m prep SDfile
Find this compound or compounds like it in BindingDB:
Activity Spreadsheet -- Enzyme Inhibition Constant Data from BindingDB
Found 1 hit for monomerid = 50162411
TargetC-C chemokine receptor type 3(Homo sapiens (Human))
Biographics Laboratory 3R
Curated by ChEMBL
LigandPNGBDBM50162411(CHEMBL194161 | [2-(4-tert-Butyl-phenyl)-2-(4-cyclo...)
Affinity DataKi:  346nM. Assay description: Inhibition of [125I]-eotaxin-1 binding to human chemokine receptor (hCCR3-C1)
In DepthDetails ArticlePubMed