BDBM50162425 CHEMBL365596::[2-(4-tert-Butyl-phenyl)-2-(4-cyclohexyl-piperazin-1-yl)-ethyl]-phenethyl-amine
SMILES CC(C)(C)c1ccc(cc1)C(CNCCc1ccccc1)N1CCN(CC1)C1CCCCC1
InChI Key InChIKey=BRLXSTZIVYPJNE-UHFFFAOYSA-N
Data  1 KI
  Tab Delimited (TSV)   2D SDfile   Computed 3D by Vconf -m prep SDfile
Find this compound or compounds like it in BindingDB:
Activity Spreadsheet -- Enzyme Inhibition Constant Data from BindingDB
Found 1 hit for monomerid = 50162425
TargetC-C chemokine receptor type 3(Homo sapiens (Human))
Biographics Laboratory 3R
Curated by ChEMBL
LigandPNGBDBM50162425(CHEMBL365596 | [2-(4-tert-Butyl-phenyl)-2-(4-cyclo...)
Affinity DataKi:  350nM. Assay description: Inhibition of [125I]-eotaxin-1 binding to human chemokine receptor (hCCR3-C1)
In DepthDetails ArticlePubMed