BDBM50162443 CHEMBL412186::H-Glu-Gly-Leu-Asn-pTyr-Met-Val-Abu(betaPh)-NH2
SMILES CSCC[C@@H](NC(=O)[C@@H](NC(=O)[C@@H](N)C(C)c1ccccc1)C(C)C)C(=O)N[C@@H](Cc1ccc(OP(O)(O)=O)cc1)C(=O)N[C@@H](CC(N)=O)C(=O)N[C@@H](CC(C)C)C(=O)NCC(=O)N[C@@H](CCC(O)=O)C(O)=O
InChI Key InChIKey=APYXVQQEUSUKFU-HAAQRSIOSA-N
Data  1 Kd  1 EC50
  Tab Delimited (TSV)   2D SDfile   Computed 3D by Vconf -m prep SDfile
Find this compound or compounds like it in BindingDB:
Activity Spreadsheet -- Enzyme Inhibition Constant Data from BindingDB
Found 2 hits for monomerid = 50162443
TargetTyrosine-protein phosphatase non-receptor type 6(Homo sapiens (Human))
Friedrich-Schiller-University
Curated by ChEMBL
LigandPNGBDBM50162443(CHEMBL412186 | H-Glu-Gly-Leu-Asn-pTyr-Met-Val-Abu(...)
Affinity DataEC50:  8.00E+4nM. Assay description: Concentration required to stimulate SHP-1 enzymatic activity by 50%
In DepthDetails ArticlePubMed
TargetTyrosine-protein phosphatase non-receptor type 6(Homo sapiens (Human))
Friedrich-Schiller-University
Curated by ChEMBL
LigandPNGBDBM50162443(CHEMBL412186 | H-Glu-Gly-Leu-Asn-pTyr-Met-Val-Abu(...)
Affinity DataKd:  250nM. Assay description: Dissociation constant for the interaction of the compound with the GST-N-SH2 domain of SHP-1
In DepthDetails ArticlePubMed