BDBM50162499 CHEMBL3793205
SMILES O=C(Nc1cncnc1)c1ccccc1
InChI Key InChIKey=RKVZLNKZLQVUID-UHFFFAOYSA-N
Data  1 IC50
PDB links: 1 PDB ID matches this monomer.
  Tab Delimited (TSV)   2D SDfile   Computed 3D by Vconf -m prep SDfile
Find this compound or compounds like it in BindingDB:
Activity Spreadsheet -- Enzyme Inhibition Constant Data from BindingDB
Found 1 hit for monomerid = 50162499
TargetBranched-chain-amino-acid aminotransferase, mitochondrial(Homo sapiens (Human))
Glaxosmithkline
Curated by ChEMBL
LigandPNGBDBM50162499(CHEMBL3793205)
Affinity DataIC50:  1.00E+6nM. Assay description: Inhibition of human BCATm incubated for 10 mins by Amplex red- based fluorescence analysis