BDBM50162684 CHEMBL3793603
SMILES COc1cc(cc(OC)c1OC)[C@H](C1CCCCC1)C(=O)N1CCCC[C@H]1C(=O)NC1(CCCC1)C(N)=O
InChI Key InChIKey=CLJLSNLSXOZRQP-URXFXBBRSA-N
Data  2 KI
PDB links: 1 PDB ID matches this monomer.
  Tab Delimited (TSV)   2D SDfile   Computed 3D by Vconf -m prep SDfile
Find this compound or compounds like it in BindingDB:
Activity Spreadsheet -- Enzyme Inhibition Constant Data from BindingDB
Found 2 hits for monomerid = 50162684
TargetPeptidyl-prolyl cis-trans isomerase FKBP5(Homo sapiens (Human))
Max Planck Institute Of Psychiatry
Curated by ChEMBL
LigandPNGBDBM50162684(CHEMBL3793603)
Affinity DataKi:  140nM. Assay description: Binding affinity to FKBP51 FK506-binding domain (1 to 140 amino acids) (unknown origin) incubated for 30 mins using fluorescein-conjugated 2-(5-((2-(...
TargetPeptidyl-prolyl cis-trans isomerase FKBP1A(Homo sapiens (Human))
Max Planck Institute Of Psychiatry
Curated by ChEMBL
LigandPNGBDBM50162684(CHEMBL3793603)
Affinity DataKi:  3.80E+3nM. Assay description: Binding affinity to human FKBP12 FK1 domain incubated for 30 mins using fluorescein-conjugated 2-(5-((2-(3-((R)-3-(3,4-dimethoxyphenyl)-1-((S)-1-(3,3...
In DepthDetails ArticlePubMed