BDBM50162758 4-Guanidino-N-(4-{(S)-5-[4-((S)-4-guanidino-butyrylamino)-butyl]-6-oxo-3-oxo-piperazin-2-yl}-butyl)-butyramide::CHEMBL182211
SMILES NC(=N)NCCCC(=O)NCCCC[C@@H]1NC(=O)[C@H](CCCCNC(=O)CCCNC(N)=N)NC1=O
InChI Key InChIKey=BFNCBWLBQJYAKU-HOTGVXAUSA-N
Data  1 IC50
  Tab Delimited (TSV)   2D SDfile   Computed 3D by Vconf -m prep SDfile
Find this compound or compounds like it in BindingDB:
Activity Spreadsheet -- Enzyme Inhibition Constant Data from BindingDB
Found 1 hit for monomerid = 50162758
TargetTryptase beta-2(Homo sapiens (Human))
University Of Barcelona
Curated by ChEMBL
LigandPNGBDBM50162758(4-Guanidino-N-(4-{(S)-5-[4-((S)-4-guanidino-butyry...)
Affinity DataIC50:  4.70E+3nM. Assay description: Inhibitory concentration against tryptase
In DepthDetails ArticlePubMed