BDBM50162973 CHEMBL177298::N-[4-(Benzothiazol-6-ylamino)-6-(1-methyl-1-phenyl-ethylamino)-[1,3,5]triazin-2-yl]-hydroxylamine
SMILES CC(C)(Nc1nc(NO)nc(Nc2ccc3ncsc3c2)n1)c1ccccc1
InChI Key InChIKey=DOXJXXFTEWRETQ-UHFFFAOYSA-N
Data  9 IC50
  Tab Delimited (TSV)   2D SDfile   Computed 3D by Vconf -m prep SDfile
Find this compound or compounds like it in BindingDB:
Activity Spreadsheet -- Enzyme Inhibition Constant Data from BindingDB
Found 9 hits for monomerid = 50162973
TargetInsulin receptor(Homo sapiens (Human))
Johnson & Johnson Pharmaceutical Research And Development
Curated by ChEMBL
LigandPNGBDBM50162973(CHEMBL177298 | N-[4-(Benzothiazol-6-ylamino)-6-(1-...)
Affinity DataIC50:  420nM. Assay description: Inhibition of beta IRK tyrosine kinase
In DepthDetails ArticlePubMed
TargetPlatelet-derived growth factor receptor alpha/beta(Homo sapiens (Human))
Johnson & Johnson Pharmaceutical Research And Development
Curated by ChEMBL
LigandPNGBDBM50162973(CHEMBL177298 | N-[4-(Benzothiazol-6-ylamino)-6-(1-...)
Affinity DataIC50:  3.90E+3nM. Assay description: Inhibition of PDGF-R2 tyrosine kinase
In DepthDetails ArticlePubMed
TargetInsulin receptor(Homo sapiens (Human))
Johnson & Johnson Pharmaceutical Research And Development
Curated by ChEMBL
LigandPNGBDBM50162973(CHEMBL177298 | N-[4-(Benzothiazol-6-ylamino)-6-(1-...)
Affinity DataIC50: >1.00E+4nM. Assay description: Inhibition of human Insulin receptor expressed in CHO cells
In DepthDetails ArticlePubMed
TargetVascular endothelial growth factor receptor 2(Homo sapiens (Human))
Johnson & Johnson Pharmaceutical Research And Development
Curated by ChEMBL
LigandPNGBDBM50162973(CHEMBL177298 | N-[4-(Benzothiazol-6-ylamino)-6-(1-...)
Affinity DataIC50:  40nM. Assay description: In vitro inhibition of Vascular endothelial growth factor receptor 2 at 10 uM ATP
In DepthDetails ArticlePubMed
TargetVascular endothelial growth factor receptor 2(Homo sapiens (Human))
Johnson & Johnson Pharmaceutical Research And Development
Curated by ChEMBL
LigandPNGBDBM50162973(CHEMBL177298 | N-[4-(Benzothiazol-6-ylamino)-6-(1-...)
Affinity DataIC50:  40nM. Assay description: In vitro inhibition of Vascular endothelial growth factor receptor 2 at 10 uM ATP
In DepthDetails ArticlePubMed
TargetFibroblast growth factor receptor 1(Mus musculus)
Johnson & Johnson Pharmaceutical Research And Development
Curated by ChEMBL
LigandPNGBDBM50162973(CHEMBL177298 | N-[4-(Benzothiazol-6-ylamino)-6-(1-...)
Affinity DataIC50: >1.00E+4nM. Assay description: Inhibition of mouse Fibroblast growth factor receptor 1 expressed in NIH 3T3 fibroblasts
In DepthDetails ArticlePubMed
TargetMacrophage colony-stimulating factor 1 receptor(Homo sapiens (Human))
Johnson & Johnson Pharmaceutical Research And Development
Curated by ChEMBL
LigandPNGBDBM50162973(CHEMBL177298 | N-[4-(Benzothiazol-6-ylamino)-6-(1-...)
Affinity DataIC50:  1.40E+4nM. Assay description: Inhibition of c-fms tyrosine kinase
In DepthDetails ArticlePubMed
TargetEpidermal growth factor receptor(Homo sapiens (Human))
Johnson & Johnson Pharmaceutical Research And Development
Curated by ChEMBL
LigandPNGBDBM50162973(CHEMBL177298 | N-[4-(Benzothiazol-6-ylamino)-6-(1-...)
Affinity DataIC50: >1.00E+4nM. Assay description: Inhibition of human epidermal growth factor receptor
In DepthDetails ArticlePubMed
TargetAngiopoietin-1 receptor(Homo sapiens (Human))
Johnson & Johnson Pharmaceutical Research And Development
Curated by ChEMBL
LigandPNGBDBM50162973(CHEMBL177298 | N-[4-(Benzothiazol-6-ylamino)-6-(1-...)
Affinity DataIC50:  700nM. Assay description: Inhibition of tyrosine protein kinase receptor TIE-2
In DepthDetails ArticlePubMed