BDBM50163128 2-(2,4-Dichloro-phenyl)-1-(4-fluoro-phenyl)-5-methyl-1H-imidazole-4-carboxylic acid piperidin-1-ylamide::CHEMBL175368
SMILES Cc1c(nc(-c2ccc(Cl)cc2Cl)n1-c1ccc(F)cc1)C(=O)NN1CCCCC1
InChI Key InChIKey=PIQKCFMGYGBVIK-UHFFFAOYSA-N
Data  2 KI
  Tab Delimited (TSV)   2D SDfile   Computed 3D by Vconf -m prep SDfile
Find this compound or compounds like it in BindingDB:
Activity Spreadsheet -- Enzyme Inhibition Constant Data from BindingDB
Found 2 hits for monomerid = 50163128
TargetCannabinoid receptor 1(Homo sapiens (Human))
Solvay Pharma
Curated by ChEMBL
LigandPNGBDBM50163128(2-(2,4-Dichloro-phenyl)-1-(4-fluoro-phenyl)-5-meth...)
Affinity DataKi:  52nM. Assay description: In vitro displacement of CP-55940 binding to human CB1 receptor expressed in CHO cells
In DepthDetails ArticlePubMed
TargetCannabinoid receptor 2(Homo sapiens (Human))
Solvay Pharma
Curated by ChEMBL
LigandPNGBDBM50163128(2-(2,4-Dichloro-phenyl)-1-(4-fluoro-phenyl)-5-meth...)
Affinity DataKi:  765nM. Assay description: In vitro displacement of CP-55940 binding to human CB2 receptor expressed in CHO cells
In DepthDetails ArticlePubMed