BDBM50163199 1-(5-Pyridin-2-yl-oxazol-2-yl)-7-trimethylsilanyl-hept-6-yn-1-one::CHEMBL177486
SMILES C[Si](C)(C)C#CCCCCC(=O)c1ncc(o1)-c1ccccn1
InChI Key InChIKey=LCQJRGFWCONPKG-UHFFFAOYSA-N
Data  1 KI
  Tab Delimited (TSV)   2D SDfile   Computed 3D by Vconf -m prep SDfile
Find this compound or compounds like it in BindingDB:
Activity Spreadsheet -- Enzyme Inhibition Constant Data from BindingDB
Found 1 hit for monomerid = 50163199
TargetFatty-acid amide hydrolase 1 [30-579](Rattus norvegicus (rat))
The Scripps Research Institute
Curated by ChEMBL
LigandPNGBDBM50163199(1-(5-Pyridin-2-yl-oxazol-2-yl)-7-trimethylsilanyl-...)
Affinity DataKi:  200nM. Assay description: Inhibitory constant determined against recombinant Fatty-acid amide hydrolase from rat expressed in Escherichia coli
In DepthDetails ArticlePubMed