BDBM50163321 CHEMBL3793136
SMILES O=C1N(CCCCCCCCCN2CCN(Cc3ccccc3)CC2)C(=O)c2ccccc12
InChI Key InChIKey=ZSVRCSKJPOPYPJ-UHFFFAOYSA-N
Data  2 IC50
  Tab Delimited (TSV)   2D SDfile   Computed 3D by Vconf -m prep SDfile
Find this compound or compounds like it in BindingDB:
Activity Spreadsheet -- Enzyme Inhibition Constant Data from BindingDB
Found 2 hits for monomerid = 50163321
TargetAcetylcholinesterase(Electrophorus electricus (Electric eel))
Chinese Academy Of Agricultural Sciences
Curated by ChEMBL
LigandPNGBDBM50163321(CHEMBL3793136)
Affinity DataIC50:  41nM. Assay description: Inhibition of electric eel AChE preincubated for 15 mins followed by addition of acetylthiocholine iodide substrate by Ellman's method-based spectrop...
In DepthDetails ArticlePubMed
TargetCholinesterase(Equus caballus (Horse))
Chinese Academy Of Agricultural Sciences
Curated by ChEMBL
LigandPNGBDBM50163321(CHEMBL3793136)
Affinity DataIC50:  33nM. Assay description: Inhibition of equine serum BChE using butyrylthiocholine iodide as substrate by Ellman's method-based spectrophotometric analysis
In DepthDetails ArticlePubMed