BDBM50163482 CHEMBL3793989
SMILES Cn1c(nc2ccc(cc12)-n1ccc(OCc2ccc(Cl)cn2)cc1=O)C1CC1
InChI Key InChIKey=PPVWKZWUSNETPC-UHFFFAOYSA-N
Data  2 IC50
  Tab Delimited (TSV)   2D SDfile   Computed 3D by Vconf -m prep SDfile
Find this compound or compounds like it in BindingDB:
Activity Spreadsheet -- Enzyme Inhibition Constant Data from BindingDB
Found 2 hits for monomerid = 50163482
TargetMelanin-concentrating hormone receptor 1(Homo sapiens (Human))
Takeda Pharmaceutical
Curated by ChEMBL
LigandPNGBDBM50163482(CHEMBL3793989)
Affinity DataIC50:  73nM. Assay description: Displacement of [125I]-MCH(4 to 19) from human MCHR1 expressed in CHO cell membranes after 1 hr by liquid scintillation counting
In DepthDetails ArticlePubMed
TargetMelanin-concentrating hormone receptor 1(RAT)
Takeda Pharmaceutical
Curated by ChEMBL
LigandPNGBDBM50163482(CHEMBL3793989)
Affinity DataIC50:  47nM. Assay description: Displacement of [125I]-MCH(4-19) from rat MCHR1 expressed in CHO cell membranes after 1 hr by liquid scintillation counting
In DepthDetails ArticlePubMed