BDBM50163509 CHEMBL3578244
SMILES Cc1n(nc2ccc(cc12)-n1ccc(OCc2csc(c2)C(F)(F)F)cc1=O)C1CC1
InChI Key InChIKey=FAALBEAEXAFDGY-UHFFFAOYSA-N
Data  5 IC50
  Tab Delimited (TSV)   2D SDfile   Computed 3D by Vconf -m prep SDfile
Find this compound or compounds like it in BindingDB:
Activity Spreadsheet -- Enzyme Inhibition Constant Data from BindingDB
Found 5 hits for monomerid = 50163509
TargetMelanin-concentrating hormone receptor 1(RAT)
Takeda Pharmaceutical
Curated by ChEMBL
LigandPNGBDBM50163509(CHEMBL3578244)
Affinity DataIC50:  26nM. Assay description: Displacement of [125I]-MCH(4 to 19) from rat MCHR1 expressed in CHO cell membranes after 1 hr by liquid scintillation counting
In DepthDetails ArticlePubMed
TargetMelanin-concentrating hormone receptor 1(Homo sapiens (Human))
Takeda Pharmaceutical
Curated by ChEMBL
LigandPNGBDBM50163509(CHEMBL3578244)
Affinity DataIC50:  38nM. Assay description: Displacement of [125I]-MCH(4 to 19) from human MCHR1 expressed in CHO cell membranes after 1 hr liquid scintillation counting
In DepthDetails ArticlePubMed
TargetPotassium voltage-gated channel subfamily H member 2(Homo sapiens (Human))
Takeda Pharmaceutical
Curated by ChEMBL
LigandPNGBDBM50163509(CHEMBL3578244)
Affinity DataIC50: >1.00E+4nM. Assay description: Inhibition of human ERG
In DepthDetails ArticlePubMed
TargetCytochrome P450 3A4(Homo sapiens (Human))
Takeda Pharmaceutical
Curated by ChEMBL
LigandPNGBDBM50163509(CHEMBL3578244)
Affinity DataIC50: >1.00E+4nM. Assay description: Time-dependent inhibition of CYP3A4 (unknown origin)
In DepthDetails ArticlePubMed
TargetMelanin-concentrating hormone receptor 1(Homo sapiens (Human))
Takeda Pharmaceutical
Curated by ChEMBL
LigandPNGBDBM50163509(CHEMBL3578244)
Affinity DataIC50:  79nM. Assay description: Antagonist activity at human MCHR1 expressed in CHO cells assessed as inhibition of MCH-stimulated Ca2+ mobilization measured every 2 secs by fluorom...
In DepthDetails ArticlePubMed