BDBM50163510 CHEMBL3794501
SMILES Cc1nn(C)c2ccc(cc12)-n1ccc(OCc2ccc(Cl)cc2)cc1=O
InChI Key InChIKey=GYUMQLBKRNQWOV-UHFFFAOYSA-N
Data  1 IC50
  Tab Delimited (TSV)   2D SDfile   Computed 3D by Vconf -m prep SDfile
Find this compound or compounds like it in BindingDB:
Activity Spreadsheet -- Enzyme Inhibition Constant Data from BindingDB
Found 1 hit for monomerid = 50163510
TargetMelanin-concentrating hormone receptor 1(Homo sapiens (Human))
Takeda Pharmaceutical
Curated by ChEMBL
LigandPNGBDBM50163510(CHEMBL3794501)
Affinity DataIC50:  99nM. Assay description: Displacement of [125I]-MCH(4 to 19) from human MCHR1 expressed in CHO cell membranes after 1 hr liquid scintillation counting
In DepthDetails ArticlePubMed