BDBM50163513 CHEMBL541121::N-(4-Benzoyl-phenyl)-2-[4-(6-chloro-2-oxo-4H-benzo[d][1,3]oxazin-1-yl)-piperidin-1-yl]-acetamide; hydrochloride
SMILES Clc1ccc2N(C3CCN(CC(=O)Nc4ccc(cc4)C(=O)c4ccccc4)CC3)C(=O)OCc2c1
InChI Key InChIKey=UOVALICTZSCIEC-UHFFFAOYSA-N
Data  1 IC50
  Tab Delimited (TSV)   2D SDfile   Computed 3D by Vconf -m prep SDfile
Find this compound or compounds like it in BindingDB:
Activity Spreadsheet -- Enzyme Inhibition Constant Data from BindingDB
Found 1 hit for monomerid = 50163513
TargetNeuropeptide Y receptor type 5(Rat 6B)
Laboratorios Dr. Esteve
Curated by ChEMBL
LigandPNGBDBM50163513(CHEMBL541121 | N-(4-Benzoyl-phenyl)-2-[4-(6-chloro...)
Affinity DataIC50:  11.2nM. Assay description: Inhibition of [125I]PYY binding to the rat NPY Y5 receptor in C6 cells
In DepthDetails ArticlePubMed