BDBM50163550 2-[4-(6-Chloro-2-oxo-4H-benzo[d][1,3]oxazin-1-yl)-piperidin-1-yl]-N-(4-phenoxy-phenyl)-acetamide::CHEMBL537858
SMILES Clc1ccc2N(C3CCN(CC(=O)Nc4ccc(Oc5ccccc5)cc4)CC3)C(=O)OCc2c1
InChI Key InChIKey=PLMVJLXENUIWLZ-UHFFFAOYSA-N
Data  1 IC50
  Tab Delimited (TSV)   2D SDfile   Computed 3D by Vconf -m prep SDfile
Find this compound or compounds like it in BindingDB:
Activity Spreadsheet -- Enzyme Inhibition Constant Data from BindingDB
Found 1 hit for monomerid = 50163550
TargetNeuropeptide Y receptor type 5(Rat 6B)
Laboratorios Dr. Esteve
Curated by ChEMBL
LigandPNGBDBM50163550(2-[4-(6-Chloro-2-oxo-4H-benzo[d][1,3]oxazin-1-yl)-...)
Affinity DataIC50:  60.7nM. Assay description: Inhibition of [125I]PYY binding to the rat NPY Y5 receptor in C6 cells
In DepthDetails ArticlePubMed