BDBM50163558 CHEMBL3793344
SMILES [H][C@@]12C[C@@]([H])(C1(C)C)[C@]1(C)OB(OC1C2)[C@H](CC(C)C)NC(=O)[C@H](Cc1ccccc1)NC(=O)C1CCCc2ccccc12
InChI Key InChIKey=VOTDVUBZDFZSLV-DZZBKFGJSA-N
Data  2 IC50
  Tab Delimited (TSV)   2D SDfile   Computed 3D by Vconf -m prep SDfile
Find this compound or compounds like it in BindingDB:
Activity Spreadsheet -- Enzyme Inhibition Constant Data from BindingDB
Found 2 hits for monomerid = 50163558
TargetProteasome subunit beta type-5(Homo sapiens (Human))
Nanjing Forestry University
Curated by ChEMBL
LigandPNGBDBM50163558(CHEMBL3793344)
Affinity DataIC50:  4.18nM. Assay description: Inhibition of chymotrypsin like activity of human 20S proteasome using Suc-Leu-Leu-Val-Tyr-AMC as substrate preincubated for 10 mins followed by subs...
In DepthDetails ArticlePubMed
TargetProteasome subunit beta type-5(Homo sapiens (Human))
Nanjing Forestry University
Curated by ChEMBL
LigandPNGBDBM50163558(CHEMBL3793344)
Affinity DataIC50:  4.20nM. Assay description: Inhibition of chymotrypsin like activity of human 20S proteasome using Suc-Leu-Leu-Val-Tyr-AMC as substrate preincubated for 10 mins followed by subs...
In DepthDetails ArticlePubMed