BDBM50163604 1-(3-Ethyl-2-methyl-quinolin-6-yl)-2-phenyl-ethanone::CHEMBL177586
SMILES CCc1cc2cc(ccc2nc1C)C(=O)Cc1ccccc1
InChI Key InChIKey=XGOOJYHXXUKMSU-UHFFFAOYSA-N
Data  2 IC50
  Tab Delimited (TSV)   2D SDfile   Computed 3D by Vconf -m prep SDfile
Find this compound or compounds like it in BindingDB:
Activity Spreadsheet -- Enzyme Inhibition Constant Data from BindingDB
Found 2 hits for monomerid = 50163604
TargetMetabotropic glutamate receptor 1(RAT)
Janssen-Cilag
Curated by ChEMBL
LigandPNGBDBM50163604(1-(3-Ethyl-2-methyl-quinolin-6-yl)-2-phenyl-ethano...)
Affinity DataIC50:  10nM. Assay description: Inhibitory concentration against rat metabotropic glutamate receptor 1
In DepthDetails ArticlePubMed
TargetMetabotropic glutamate receptor 1(Homo sapiens (Human))
Janssen-Cilag
Curated by ChEMBL
LigandPNGBDBM50163604(1-(3-Ethyl-2-methyl-quinolin-6-yl)-2-phenyl-ethano...)
Affinity DataIC50:  51nM. Assay description: Inhibitory concentration against human metabotropic glutamate receptor
In DepthDetails ArticlePubMed