BDBM50163625 1-(3-Ethyl-2-methyl-quinolin-6-yl)-3-methyl-butan-1-one::CHEMBL175610
SMILES CCc1cc2cc(ccc2nc1C)C(=O)CC(C)C
InChI Key InChIKey=HTRSCSAGTJUVRL-UHFFFAOYSA-N
Data  1 IC50
  Tab Delimited (TSV)   2D SDfile   Computed 3D by Vconf -m prep SDfile
Find this compound or compounds like it in BindingDB:
Activity Spreadsheet -- Enzyme Inhibition Constant Data from BindingDB
Found 1 hit for monomerid = 50163625
TargetMetabotropic glutamate receptor 1(RAT)
Janssen-Cilag
Curated by ChEMBL
LigandPNGBDBM50163625(1-(3-Ethyl-2-methyl-quinolin-6-yl)-3-methyl-butan-...)
Affinity DataIC50:  162nM. Assay description: Inhibitory concentration against rat metabotropic glutamate receptor 1
In DepthDetails ArticlePubMed