BDBM50163669 CHEMBL3793066
SMILES [H][C@@]12C[C@@]([H])(C1(C)C)[C@]1(C)OB(OC1C2)[C@H](Cc1ccccc1)NC(=O)[C@H](Cc1ccccc1)NC(=O)C1CCc2ccccc2C1
InChI Key InChIKey=IAHVPEKZALDLIY-PLHGRVIESA-N
Data  2 IC50
  Tab Delimited (TSV)   2D SDfile   Computed 3D by Vconf -m prep SDfile
Find this compound or compounds like it in BindingDB:
Activity Spreadsheet -- Enzyme Inhibition Constant Data from BindingDB
Found 2 hits for monomerid = 50163669
TargetProteasome subunit beta type-5(Homo sapiens (Human))
Nanjing Forestry University
Curated by ChEMBL
LigandPNGBDBM50163669(CHEMBL3793066)
Affinity DataIC50:  3.37nM. Assay description: Inhibition of chymotrypsin like activity of human 20S proteasome using Suc-Leu-Leu-Val-Tyr-AMC as substrate preincubated for 10 mins followed by subs...
In DepthDetails ArticlePubMed
TargetProteasome subunit beta type-5(Homo sapiens (Human))
Nanjing Forestry University
Curated by ChEMBL
LigandPNGBDBM50163669(CHEMBL3793066)
Affinity DataIC50:  3.40nM. Assay description: Inhibition of chymotrypsin like activity of human 20S proteasome using Suc-Leu-Leu-Val-Tyr-AMC as substrate preincubated for 10 mins followed by subs...
In DepthDetails ArticlePubMed