BDBM50164225 CHEMBL365470::N-[6-(Imidazo[1,2-d][1,2,4]thiadiazol-3-ylamino)-hexyl]-2-methyl-benzenesulfonamide
SMILES Cc1ccccc1S(=O)(=O)NCCCCCCNc1nsc2nccn12
InChI Key InChIKey=SHCHYVBWWCFVCO-UHFFFAOYSA-N
Data  1 IC50
  Tab Delimited (TSV)   2D SDfile   Computed 3D by Vconf -m prep SDfile
Find this compound or compounds like it in BindingDB:
Activity Spreadsheet -- Enzyme Inhibition Constant Data from BindingDB
Found 1 hit for monomerid = 50164225
TargetCoagulation factor XIII A chain(Homo sapiens (Human))
Apotex Research
Curated by ChEMBL
LigandPNGBDBM50164225(CHEMBL365470 | N-[6-(Imidazo[1,2-d][1,2,4]thiadiaz...)
Affinity DataIC50:  700nM. Assay description: In vitro inhibitory concentration of compound against factor XIIIa
In DepthDetails ArticlePubMed