BDBM50164345 6-(4-Methoxy-phenyl)-3-{3-[4-(2-methoxy-phenyl)-piperazin-1-yl]-propyl}-1,5-dihydro-pyrrolo[3,2-d]pyrimidine-2,4-dione::CHEMBL190034
SMILES COc1ccc(cc1)-c1cc2[nH]c(=O)n(CCCN3CCN(CC3)c3ccccc3OC)c(=O)c2[nH]1
InChI Key InChIKey=NSXWXRWMWCJXJX-UHFFFAOYSA-N
Data  3 KI
  Tab Delimited (TSV)   2D SDfile   Computed 3D by Vconf -m prep SDfile
Find this compound or compounds like it in BindingDB:
Activity Spreadsheet -- Enzyme Inhibition Constant Data from BindingDB
Found 3 hits for monomerid = 50164345
TargetD(2) dopamine receptor(Rattus norvegicus (rat))
Università
Curated by ChEMBL
LigandPNGBDBM50164345(6-(4-Methoxy-phenyl)-3-{3-[4-(2-methoxy-phenyl)-pi...)
Affinity DataKi:  2.11nM. Assay description: Inhibition of [3H]-spiperone binding to Dopamine receptor D2 from rat striatum
In DepthDetails ArticlePubMed
Target5-hydroxytryptamine receptor 1A(Rattus norvegicus (rat))
Università
Curated by ChEMBL
LigandPNGBDBM50164345(6-(4-Methoxy-phenyl)-3-{3-[4-(2-methoxy-phenyl)-pi...)
Affinity DataKi:  526nM. Assay description: Inhibtion of [3H]-8-OH-DPAT binding to 5-hydroxytryptamine 1A receptor from rat hippocampus
In DepthDetails ArticlePubMed
TargetD(1A) dopamine receptor(RAT)
Università
Curated by ChEMBL
LigandPNGBDBM50164345(6-(4-Methoxy-phenyl)-3-{3-[4-(2-methoxy-phenyl)-pi...)
Affinity DataKi: >1.00E+4nM. Assay description: Inhibition of [3H]-SCH-23,390 binding to Dopamine receptor D1 from rat striatum
In DepthDetails ArticlePubMed