BDBM50164353 6-(3-Chloro-phenyl)-3-{2-[4-(2-methoxy-phenyl)-piperazin-1-yl]-ethyl}-1,5-dihydro-pyrrolo[3,2-d]pyrimidine-2,4-dione::CHEMBL190586
SMILES COc1ccccc1N1CCN(CCn2c(=O)[nH]c3cc([nH]c3c2=O)-c2cccc(Cl)c2)CC1
InChI Key InChIKey=XLQSBZDIAONQNW-UHFFFAOYSA-N
Data  1 KI
  Tab Delimited (TSV)   2D SDfile   Computed 3D by Vconf -m prep SDfile
Find this compound or compounds like it in BindingDB:
Activity Spreadsheet -- Enzyme Inhibition Constant Data from BindingDB
Found 1 hit for monomerid = 50164353
Target5-hydroxytryptamine receptor 1A(Rattus norvegicus (rat))
Università
Curated by ChEMBL
LigandPNGBDBM50164353(6-(3-Chloro-phenyl)-3-{2-[4-(2-methoxy-phenyl)-pip...)
Affinity DataKi:  16.9nM. Assay description: Inhibtion of [3H]-8-OH-DPAT binding to 5-hydroxytryptamine 1A receptor from rat hippocampus
In DepthDetails ArticlePubMed