BDBM50164459 2-[4-(9H-5,6-Dioxa-benzocyclohepten-1-yl)-piperazin-1-ylmethyl]-hexahydro-pyrrolo[1,2-a]pyrazine-1,4-dione::CHEMBL372014
SMILES O=C1CN(CN2CCN(CC2)c2cccc3OOC=CCc23)C(=O)C2CCCN12
InChI Key InChIKey=RATBIOFLCYTPEU-UHFFFAOYSA-N
Data  2 KI
  Tab Delimited (TSV)   2D SDfile   Computed 3D by Vconf -m prep SDfile
Find this compound or compounds like it in BindingDB:
Activity Spreadsheet -- Enzyme Inhibition Constant Data from BindingDB
Found 2 hits for monomerid = 50164459
Target5-hydroxytryptamine receptor 1A(Rattus norvegicus (rat))
TBA
Curated by ChEMBL
LigandPNGBDBM50164459(2-[4-(9H-5,6-Dioxa-benzocyclohepten-1-yl)-piperazi...)
Affinity DataKi:  12nM. Assay description: In vitro inhibition of [3H]8-OH-DPAT binding to 5-hydroxytryptamine 1A receptor in rat cerebral cortex membranes
In DepthDetails ArticlePubMed
TargetAlpha-1A/Alpha-1B/Alpha-1D adrenergic receptor(Rattus norvegicus (rat))
TBA
Curated by ChEMBL
LigandPNGBDBM50164459(2-[4-(9H-5,6-Dioxa-benzocyclohepten-1-yl)-piperazi...)
Affinity DataKi: >1.00E+3nM. Assay description: In vitro inhibition of [3H]prazosin binding to Alpha-1 adrenergic receptor in rat cerebral cortex membranes
In DepthDetails ArticlePubMed