BDBM50164469 2-(2-Dimethylaminomethyl-phenylsulfanyl)-5-fluoro-phenylamine::CHEMBL190860::N-{2-[(2-amino-4-fluorophenyl)thio]benzyl}-N,N-dimethylamine
SMILES CN(C)Cc1ccccc1Sc1ccc(F)cc1N
InChI Key InChIKey=ODXYYPIOITXURW-UHFFFAOYSA-N
Data  3 KI
  Tab Delimited (TSV)   2D SDfile   Computed 3D by Vconf -m prep SDfile
Find this compound or compounds like it in BindingDB:
Activity Spreadsheet -- Enzyme Inhibition Constant Data from BindingDB
Found 3 hits for monomerid = 50164469
TargetSodium-dependent serotonin transporter(Homo sapiens (Human))
Columbia University College Of Physicians And Surgeons
Curated by ChEMBL
LigandPNGBDBM50164469(2-(2-Dimethylaminomethyl-phenylsulfanyl)-5-fluoro-...)
Affinity DataKi:  1.46nM. Assay description: In vitro displacement of [3H]-paroxetine from human serotonin transporter expressed in HEK-293 cells
In DepthDetails ArticlePubMed
TargetSodium-dependent noradrenaline transporter(Homo sapiens (Human))
Columbia University College Of Physicians And Surgeons
Curated by ChEMBL
LigandPNGBDBM50164469(2-(2-Dimethylaminomethyl-phenylsulfanyl)-5-fluoro-...)
Affinity DataKi:  142nM. Assay description: In vitro displacement of [3H]-nisoxetine from human norepinephrine transporter expressed in HEK-293 cells
In DepthDetails ArticlePubMed
TargetSodium-dependent dopamine transporter(Homo sapiens (Human))
Columbia University College Of Physicians And Surgeons
Curated by ChEMBL
LigandPNGBDBM50164469(2-(2-Dimethylaminomethyl-phenylsulfanyl)-5-fluoro-...)
Affinity DataKi: >1.00E+4nM. Assay description: In vitro displacement of [3H]-GBR-12,935 from human dopamine transporter expressed in HEK-293 cells
In DepthDetails ArticlePubMed