BDBM50164482 CHEMBL3800265
SMILES Cc1sc2nc(COc3ccc(F)cc3)cc(=O)n2c1[C@@H]1C[C@H]1CO
InChI Key InChIKey=CJDCZVBFZVDWJU-XHDPSFHLSA-N
Data  3 EC50
PDB links: 3 PDB IDs match this monomer.
  Tab Delimited (TSV)   2D SDfile   Computed 3D by Vconf -m prep SDfile
Find this compound or compounds like it in BindingDB:
Activity Spreadsheet -- Enzyme Inhibition Constant Data from BindingDB
Found 3 hits for monomerid = 50164482
TargetGlutamate receptor 2(Homo sapiens (Human))
Pharmaron-Beijing
Curated by ChEMBL
LigandPNGBDBM50164482(CHEMBL3800265)
Affinity DataEC50:  5.40E+3nM. Assay description: Positive allosteric modulation of human GluA2 AMPAR flip isomer expressed in Dox-inducible cells measured every 5 mins by BD calcium indicator dye ba...
In DepthDetails ArticlePubMed
TargetGlutamate receptor 2(Homo sapiens (Human))
Pharmaron-Beijing
Curated by ChEMBL
LigandPNGBDBM50164482(CHEMBL3800265)
Affinity DataEC50:  2.30E+3nM. Assay description: Positive allosteric modulation of human GluA2 AMPAR flop isomer expressed in Dox-inducible cells measured every 5 mins by BD calcium indicator dye ba...
In DepthDetails ArticlePubMed
TargetGlutamate receptor ionotropic, NMDA 1/2A(Homo sapiens (Human))
Pharmaron-Beijing
Curated by ChEMBL
LigandPNGBDBM50164482(CHEMBL3800265)
Affinity DataEC50:  382nM. Assay description: Positive allosteric modulation of GluN1/GluN2A NMDAR (unknown origin) expressed in Dox-inducible cells measured every 5 mins by BD calcium indicator ...