BDBM50164485 CHEMBL3799657
SMILES CCN(Cc1cc(=O)n2c([C@@H]3C[C@H]3CO)c(C)sc2n1)c1ccc(F)cc1
InChI Key InChIKey=QJWNABRYUWESMF-SUMWQHHRSA-N
Data  3 EC50
  Tab Delimited (TSV)   2D SDfile   Computed 3D by Vconf -m prep SDfile
Find this compound or compounds like it in BindingDB:
Activity Spreadsheet -- Enzyme Inhibition Constant Data from BindingDB
Found 3 hits for monomerid = 50164485
TargetGlutamate receptor 2(Homo sapiens (Human))
Pharmaron-Beijing
Curated by ChEMBL
LigandPNGBDBM50164485(CHEMBL3799657)
Affinity DataEC50:  870nM. Assay description: Positive allosteric modulation of human GluA2 AMPAR flip isomer expressed in Dox-inducible cells measured every 5 mins by BD calcium indicator dye ba...
In DepthDetails ArticlePubMed
TargetGlutamate receptor 2(Homo sapiens (Human))
Pharmaron-Beijing
Curated by ChEMBL
LigandPNGBDBM50164485(CHEMBL3799657)
Affinity DataEC50:  204nM. Assay description: Positive allosteric modulation of human GluA2 AMPAR flop isomer expressed in Dox-inducible cells measured every 5 mins by BD calcium indicator dye ba...
In DepthDetails ArticlePubMed
TargetGlutamate receptor ionotropic, NMDA 1/2A(Homo sapiens (Human))
Pharmaron-Beijing
Curated by ChEMBL
LigandPNGBDBM50164485(CHEMBL3799657)
Affinity DataEC50:  24nM. Assay description: Positive allosteric modulation of GluN1/GluN2A NMDAR (unknown origin) expressed in Dox-inducible cells measured every 5 mins by BD calcium indicator ...
In DepthDetails ArticlePubMed