BDBM50164558 1,2-Bis-(4-chloro-phenyl)-1H-imidazole-4-carboxylic acid ethyl ester::CHEMBL192900
SMILES CCOC(=O)c1cn(c(n1)-c1ccc(Cl)cc1)-c1ccc(Cl)cc1
InChI Key InChIKey=SFFXXTXYSRSGGB-UHFFFAOYSA-N
Data  1 EC50
  Tab Delimited (TSV)   2D SDfile   Computed 3D by Vconf -m prep SDfile
Find this compound or compounds like it in BindingDB:
Activity Spreadsheet -- Enzyme Inhibition Constant Data from BindingDB
Found 1 hit for monomerid = 50164558
TargetGamma-aminobutyric acid receptor subunit alpha-2/beta-2/gamma-2(Homo sapiens (Human))
Universit£
Curated by ChEMBL
LigandPNGBDBM50164558(1,2-Bis-(4-chloro-phenyl)-1H-imidazole-4-carboxyli...)
Affinity DataEC50:  1.50E+3nM. Assay description: Effective concentration against GABA-evoked chloride currents mediated by human Gamma-aminobutyric acid GABA-A receptor alpha2-beta2-gamma2L expresse...
In DepthDetails ArticlePubMed