BDBM50165035 6-[3-(2-Fluoro-benzyloxy)-5-isopropoxy-benzoylamino]-nicotinic acid::CHEMBL191239
SMILES CC(C)Oc1cc(OCc2ccccc2F)cc(c1)C(=O)Nc1ccc(cn1)C(O)=O
InChI Key InChIKey=MTZXGGLPHHVXRY-UHFFFAOYSA-N
Data  1 EC50
  Tab Delimited (TSV)   2D SDfile   Computed 3D by Vconf -m prep SDfile
Find this compound or compounds like it in BindingDB:
Activity Spreadsheet -- Enzyme Inhibition Constant Data from BindingDB
Found 1 hit for monomerid = 50165035
TargetHexokinase-4(Homo sapiens (Human))
Astrazeneca
Curated by ChEMBL
LigandPNGBDBM50165035(6-[3-(2-Fluoro-benzyloxy)-5-isopropoxy-benzoylamin...)
Affinity DataEC50:  100nM. Assay description: Potency in Glucokinase activation assay
In DepthDetails ArticlePubMed