BDBM50165282 8-(2,5-Dichloro-phenylsulfanyl)-9-pent-4-ynyl-9H-purin-6-ylamine::CHEMBL364450
SMILES Nc1ncnc2n(CCCC#C)c(Sc3cc(Cl)ccc3Cl)nc12
InChI Key InChIKey=QGGASVLFFHJUTI-UHFFFAOYSA-N
Data  5 IC50  1 EC50
  Tab Delimited (TSV)   2D SDfile   Computed 3D by Vconf -m prep SDfile
Find this compound or compounds like it in BindingDB:
Activity Spreadsheet -- Enzyme Inhibition Constant Data from BindingDB
Found 6 hits for monomerid = 50165282
TargetHeat shock protein HSP 90-alpha/90-beta(Homo sapiens (Human))
Memorial Sloan-Kettering Cancer Center
Curated by ChEMBL
LigandPNGBDBM50165282(8-(2,5-Dichloro-phenylsulfanyl)-9-pent-4-ynyl-9H-p...)
Affinity DataIC50:  2.65E+4nM. Assay description: Inhibition of Hsp90 protein as degradation of HER2 kinase in SKBr3 cells
In DepthDetails ArticlePubMed
TargetHeat shock protein HSP 90-alpha(Mus musculus)
Memorial Sloan-Kettering Cancer Center
Curated by ChEMBL
LigandPNGBDBM50165282(8-(2,5-Dichloro-phenylsulfanyl)-9-pent-4-ynyl-9H-p...)
Affinity DataEC50:  2.10E+3nM. Assay description: Displacement of 5 nM GM-BODIPY from mouse heat shock protein HSP90-alpha
In DepthDetails ArticlePubMed
TargetHeat shock protein 75 kDa, mitochondrial(Homo sapiens (Human))
Sloan-Kettering Institute For Cancer Research
Curated by ChEMBL
LigandPNGBDBM50165282(8-(2,5-Dichloro-phenylsulfanyl)-9-pent-4-ynyl-9H-p...)
Affinity DataIC50:  5.10E+3nM. Assay description: Displacement of PU-FITC3 from recombinant TRAP-1 (unknown origin) after 24 hrs by fluorescence polarization assay
In DepthDetails ArticlePubMed
TargetHeat shock protein HSP 90-alpha(Homo sapiens (Human))
Sloan-Kettering Institute For Cancer Research
Curated by ChEMBL
LigandPNGBDBM50165282(8-(2,5-Dichloro-phenylsulfanyl)-9-pent-4-ynyl-9H-p...)
Affinity DataIC50:  6.04E+4nM. Assay description: Displacement of Cy3B-GM from recombinant Hsp90alpha (unknown origin) after 24 hrs by fluorescence polarization assay
In DepthDetails ArticlePubMed
TargetEndoplasmin(Homo sapiens (Human))
Sloan-Kettering Institute For Cancer Research
Curated by ChEMBL
LigandPNGBDBM50165282(8-(2,5-Dichloro-phenylsulfanyl)-9-pent-4-ynyl-9H-p...)
Affinity DataIC50:  530nM. Assay description: Displacement of Cy3B-GM from recombinant Grp94 (unknown origin) after 24 hrs by fluorescence polarization assay
In DepthDetails ArticlePubMed
TargetHeat shock protein HSP 90-beta(Homo sapiens (Human))
Sloan-Kettering Institute For Cancer Research
Curated by ChEMBL
LigandPNGBDBM50165282(8-(2,5-Dichloro-phenylsulfanyl)-9-pent-4-ynyl-9H-p...)
Affinity DataIC50: >1.00E+5nM. Assay description: Displacement of Cy3B-GM from recombinant Hsp90beta (unknown origin) after 24 hrs by fluorescence polarization assay
In DepthDetails ArticlePubMed