BDBM50165458 (S)-2-((S)-6,7-Dimethoxy-2-methyl-1,2,3,4-tetrahydro-isoquinolin-1-yl)-1-(4-methoxy-phenyl)-ethanol::CHEMBL196983
SMILES COc1ccc(cc1)[C@@H](O)C[C@@H]1N(C)CCc2cc(OC)c(OC)cc12
InChI Key InChIKey=BFMVLFRBLSHGFU-OALUTQOASA-N
Data  4 IC50
  Tab Delimited (TSV)   2D SDfile   Computed 3D by Vconf -m prep SDfile
Find this compound or compounds like it in BindingDB:
Activity Spreadsheet -- Enzyme Inhibition Constant Data from BindingDB
Found 4 hits for monomerid = 50165458
TargetPotassium voltage-gated channel subfamily H member 2(Homo sapiens (Human))
Ludwig-Maximilians-UniversitäT MüNchen
Curated by ChEMBL
LigandPNGBDBM50165458((S)-2-((S)-6,7-Dimethoxy-2-methyl-1,2,3,4-tetrahyd...)
Affinity DataIC50:  790nM. Assay description: Mean inhibitory concentration against potassium channel HERG
In DepthDetails ArticlePubMed
TargetGlutamate receptor ionotropic, NMDA 1/2B(Rattus norvegicus (Rat))
Ludwig-Maximilians-UniversitäT MüNchen
Curated by ChEMBL
LigandPNGBDBM50165458((S)-2-((S)-6,7-Dimethoxy-2-methyl-1,2,3,4-tetrahyd...)
Affinity DataIC50:  3.16E+3nM. Assay description: Mean inhibitory concentration against rat N-methyl-D-aspartate (NMDA) glutamate receptor 1a/2B expressed in Xenopus oocytes
In DepthDetails ArticlePubMed
TargetGlutamate receptor ionotropic, NMDA 1/2C(RAT)
Ludwig-Maximilians-UniversitäT MüNchen
Curated by ChEMBL
LigandPNGBDBM50165458((S)-2-((S)-6,7-Dimethoxy-2-methyl-1,2,3,4-tetrahyd...)
Affinity DataIC50:  1.55E+5nM. Assay description: Mean inhibitory concentration against rat N-methyl-D-aspartate (NMDA) glutamate receptor 1a/2C expressed in Xenopus oocytes
In DepthDetails ArticlePubMed
TargetGlutamate receptor ionotropic, NMDA 1/2A(Rattus norvegicus (Rat))
Ludwig-Maximilians-UniversitäT MüNchen
Curated by ChEMBL
LigandPNGBDBM50165458((S)-2-((S)-6,7-Dimethoxy-2-methyl-1,2,3,4-tetrahyd...)
Affinity DataIC50:  1.07E+5nM. Assay description: Mean inhibitory concentration against rat N-methyl-D-aspartate (NMDA) glutamate receptor 1a/2A expressed in Xenopus oocytes
In DepthDetails ArticlePubMed