BDBM50166328 9-[3-(2,6-Difluoro-phenyl)-prop-2-yn-(Z)-ylidene]-7-aza-tricyclo[4.3.1.0*3,7*]decane-2-carboxylic acid methyl ester::CHEMBL195181
SMILES COC(=O)C1C2CCC3CC1\C(CN23)=C\C#Cc1c(F)cccc1F
InChI Key InChIKey=KZRDLTJSEXNPFZ-UUILKARUSA-N
Data  3 KI
  Tab Delimited (TSV)   2D SDfile   Computed 3D by Vconf -m prep SDfile
Find this compound or compounds like it in BindingDB:
Activity Spreadsheet -- Enzyme Inhibition Constant Data from BindingDB
Found 3 hits for monomerid = 50166328
TargetTransporter(Rattus norvegicus)
Acenta Discovery
Curated by ChEMBL
LigandPNGBDBM50166328(9-[3-(2,6-Difluoro-phenyl)-prop-2-yn-(Z)-ylidene]-...)
Affinity DataKi:  5.30nM. Assay description: Inhibitory constant against reuptake of [3H]-NE at norepinephrine transporter of rat parietal-occipital cortex
In DepthDetails ArticlePubMed
TargetSodium-dependent serotonin transporter(Rattus norvegicus (rat))
Acenta Discovery
Curated by ChEMBL
LigandPNGBDBM50166328(9-[3-(2,6-Difluoro-phenyl)-prop-2-yn-(Z)-ylidene]-...)
Affinity DataKi:  32nM. Assay description: Inhibitory constant against reuptake of [3H]-5-HT at serotonin transporter of rat midbrain cortex
In DepthDetails ArticlePubMed
TargetSodium-dependent dopamine transporter(Rattus norvegicus (rat))
Acenta Discovery
Curated by ChEMBL
LigandPNGBDBM50166328(9-[3-(2,6-Difluoro-phenyl)-prop-2-yn-(Z)-ylidene]-...)
Affinity DataKi: >1.00E+4nM. Assay description: Inhibitory constant against reuptake of [3H]-DA at dopamine transporter of rat striatal membranes
In DepthDetails ArticlePubMed