BDBM50166341 9-[3-(4-Fluoro-phenyl)-prop-2-yn-(Z)-ylidene]-7-aza-tricyclo[4.3.1.0*3,7*]decane-2-carboxylic acid methyl ester::CHEMBL371679
SMILES COC(=O)C1C2CCC3CC1\C(CN23)=C\C#Cc1ccc(F)cc1
InChI Key InChIKey=MVNNJSLMCDONFM-LNKIKWGQSA-N
Data  3 KI
  Tab Delimited (TSV)   2D SDfile   Computed 3D by Vconf -m prep SDfile
Find this compound or compounds like it in BindingDB:
Activity Spreadsheet -- Enzyme Inhibition Constant Data from BindingDB
Found 3 hits for monomerid = 50166341
TargetSodium-dependent serotonin transporter(Rattus norvegicus (rat))
Acenta Discovery
Curated by ChEMBL
LigandPNGBDBM50166341(9-[3-(4-Fluoro-phenyl)-prop-2-yn-(Z)-ylidene]-7-az...)
Affinity DataKi:  17nM. Assay description: Inhibitory constant against reuptake of [3H]-5-HT at serotonin transporter of rat midbrain cortex
In DepthDetails ArticlePubMed
TargetTransporter(Rattus norvegicus)
Acenta Discovery
Curated by ChEMBL
LigandPNGBDBM50166341(9-[3-(4-Fluoro-phenyl)-prop-2-yn-(Z)-ylidene]-7-az...)
Affinity DataKi:  104nM. Assay description: Inhibitory constant against reuptake of [3H]-NE at norepinephrine transporter of rat parietal-occipital cortex
In DepthDetails ArticlePubMed
TargetSodium-dependent dopamine transporter(Rattus norvegicus (rat))
Acenta Discovery
Curated by ChEMBL
LigandPNGBDBM50166341(9-[3-(4-Fluoro-phenyl)-prop-2-yn-(Z)-ylidene]-7-az...)
Affinity DataKi: >1.00E+4nM. Assay description: Inhibitory constant against reuptake of [3H]-DA at dopamine transporter of rat striatal membranes
In DepthDetails ArticlePubMed