BDBM50166405 (Z)-2-Benzoylamino-3-[4-(2-bromo-phenoxy)-phenyl]-acrylic acid::2-benzamido-3-(4-(2-bromophenoxy)phenyl)acrylic acid::CHEMBL188442
SMILES OC(=O)C(\NC(=O)c1ccccc1)=C\c1ccc(Oc2ccccc2Br)cc1
InChI Key InChIKey=WLPJLQNKCJWAFL-RGEXLXHISA-N
Data  2 IC50
PDB links: 1 PDB ID matches this monomer.
  Tab Delimited (TSV)   2D SDfile   Computed 3D by Vconf -m prep SDfile
Find this compound or compounds like it in BindingDB:
Activity Spreadsheet -- Enzyme Inhibition Constant Data from BindingDB
Found 2 hits for monomerid = 50166405
TargetRNA-directed RNA polymerase(Hepatitis C virus)
Pfizer
Curated by ChEMBL
LigandPNGBDBM50166405((Z)-2-Benzoylamino-3-[4-(2-bromo-phenoxy)-phenyl]-...)
Affinity DataIC50:  100nM. Assay description: Inhibitory concentration against RNA dependent RNA polymerase Nonstructural protein 5B (HCV NS5B polymerase) in Hepatitis C virus
In DepthDetails ArticlePubMed
TargetRNA-directed RNA polymerase(Hepatitis C virus)
Pfizer
Curated by ChEMBL
LigandPNGBDBM50166405((Z)-2-Benzoylamino-3-[4-(2-bromo-phenoxy)-phenyl]-...)
Affinity DataIC50:  100nM. Assay description: Inhibitory concentration against Hepatitis C virus NS5B polymerase
In DepthDetails ArticlePubMed