BDBM50166747 CHEMBL3798940
SMILES COCCN1CCN(CC1)c1ccc2c(Nc3cc(CCc4cc(OC)cc(OC)c4)[nH]n3)ncnc2c1
InChI Key InChIKey=QLCYPZXKQOONPS-UHFFFAOYSA-N
Data  1 IC50
  Tab Delimited (TSV)   2D SDfile   Computed 3D by Vconf -m prep SDfile
Find this compound or compounds like it in BindingDB:
Activity Spreadsheet -- Enzyme Inhibition Constant Data from BindingDB
Found 1 hit for monomerid = 50166747
TargetFibroblast growth factor receptor 2(Homo sapiens (Human))
Chinese Academy Of Sciences (Cas)
Curated by ChEMBL
LigandPNGBDBM50166747(CHEMBL3798940)
Affinity DataIC50:  0.700nM. Assay description: Inhibition of recombinant FGFR2 (unknown origin) using (Glu,Tyr)4:1 as substrate incubated for 60 mins by ELISA
In DepthDetails ArticlePubMed