BDBM50166853 CHEMBL3798953
SMILES CCc1ccc(cc1)-c1cc(nc2n(ccc12)S(=O)(=O)CC(C)C)N1CCN(C)CC1
InChI Key InChIKey=LBZMBFXUYVOEEN-UHFFFAOYSA-N
Data  2 KI
  Tab Delimited (TSV)   2D SDfile   Computed 3D by Vconf -m prep SDfile
Find this compound or compounds like it in BindingDB:
Activity Spreadsheet -- Enzyme Inhibition Constant Data from BindingDB
Found 2 hits for monomerid = 50166853
Target5-hydroxytryptamine receptor 6(Homo sapiens (Human))
Selvita
Curated by ChEMBL
LigandPNGBDBM50166853(CHEMBL3798953)
Affinity DataKi:  11nM. Assay description: Displacement of [3H]LSD from human 5HT6 receptor in HEK293 cell membrane incubated for 1 hr by scintillation counting method
In DepthDetails ArticlePubMed
TargetD(2) dopamine receptor(Homo sapiens (Human))
Selvita
Curated by ChEMBL
LigandPNGBDBM50166853(CHEMBL3798953)
Affinity DataKi:  614nM. Assay description: Displacement of [3H]NMSP from human dopamine D2S receptor expressed in CHO cell membrane incubated for 1 hr by scintillation counting method
In DepthDetails ArticlePubMed