BDBM50167137 (4R,5R)-5-[(S)-(4'-Fluoro-biphenyl-3-yl)-hydroxy-methyl]-1-methyl-4-phenyl-pyrrolidin-2-one::CHEMBL363573
SMILES CN1[C@@H]([C@@H](O)c2cccc(c2)-c2ccc(F)cc2)[C@H](CC1=O)c1ccccc1
InChI Key InChIKey=DYVOWAQXTWDQNF-JRFVFWCSSA-N
Data  1 IC50
  Tab Delimited (TSV)   2D SDfile   Computed 3D by Vconf -m prep SDfile
Find this compound or compounds like it in BindingDB:
Activity Spreadsheet -- Enzyme Inhibition Constant Data from BindingDB
Found 1 hit for monomerid = 50167137
Target17-beta-hydroxysteroid dehydrogenase type 2(Homo sapiens (Human))
Bayer Research Center
Curated by ChEMBL
LigandPNGBDBM50167137((4R,5R)-5-[(S)-(4'-Fluoro-biphenyl-3-yl)-hydroxy-m...)
Affinity DataIC50:  2.78E+3nM. Assay description: Inhibitory concentration against 17 beta hydroxysteroid dehydrogenase type 2 (type II 17-beta-HSD II)
In DepthDetails ArticlePubMed