BDBM50167154 (4R,5R)-4-(4-Dimethylamino-phenyl)-5-[(R)-hydroxy-(5-phenyl-thiophen-2-yl)-methyl]-1-methyl-pyrrolidin-2-one::CHEMBL363395
SMILES CN(C)c1ccc(cc1)[C@H]1CC(=O)N(C)[C@H]1[C@@H](O)c1ccc(s1)-c1ccccc1
InChI Key InChIKey=MJQYHWUMNXYRHN-FOVJLYNBSA-N
Data  1 IC50
  Tab Delimited (TSV)   2D SDfile   Computed 3D by Vconf -m prep SDfile
Find this compound or compounds like it in BindingDB:
Activity Spreadsheet -- Enzyme Inhibition Constant Data from BindingDB
Found 1 hit for monomerid = 50167154
Target17-beta-hydroxysteroid dehydrogenase type 2(Homo sapiens (Human))
Bayer Research Center
Curated by ChEMBL
LigandPNGBDBM50167154((4R,5R)-4-(4-Dimethylamino-phenyl)-5-[(R)-hydroxy-...)
Affinity DataIC50:  2.43E+3nM. Assay description: Inhibitory concentration against 17 beta hydroxysteroid dehydrogenase type 2 (type II 17-beta-HSD II)
In DepthDetails ArticlePubMed