BDBM50167345 4-(4,6-Bis-butylamino-[1,3,5]triazin-2-ylamino)-benzenesulfonamide::CHEMBL190531
SMILES CCCCNc1nc(NCCCC)nc(Nc2ccc(cc2)S(N)(=O)=O)n1
InChI Key InChIKey=VHRZAWZQTHGYPD-UHFFFAOYSA-N
Data  3 KI
  Tab Delimited (TSV)   2D SDfile   Computed 3D by Vconf -m prep SDfile
Find this compound or compounds like it in BindingDB:
Activity Spreadsheet -- Enzyme Inhibition Constant Data from BindingDB
Found 3 hits for monomerid = 50167345
TargetCarbonic anhydrase 2(Homo sapiens (Human))
Universit£
Curated by ChEMBL
LigandPNGBDBM50167345(4-(4,6-Bis-butylamino-[1,3,5]triazin-2-ylamino)-be...)
Affinity DataKi:  146nM. Assay description: Inhibitory constant against human Carbonic anhydrase II
In DepthDetails ArticlePubMed
TargetCarbonic anhydrase 9(Homo sapiens (Human))
Universit£
Curated by ChEMBL
LigandPNGBDBM50167345(4-(4,6-Bis-butylamino-[1,3,5]triazin-2-ylamino)-be...)
Affinity DataKi:  185nM. Assay description: Inhibitory constant against human Carbonic anhydrase IX
In DepthDetails ArticlePubMed
TargetCarbonic anhydrase 1(Homo sapiens (Human))
Universit£
Curated by ChEMBL
LigandPNGBDBM50167345(4-(4,6-Bis-butylamino-[1,3,5]triazin-2-ylamino)-be...)
Affinity DataKi:  561nM. Assay description: Inhibitory constant against human Carbonic anhydrase I
In DepthDetails ArticlePubMed