BDBM50167350 4-[(4,6-Bis-dimethylamino-[1,3,5]triazin-2-ylamino)-methyl]-benzenesulfonamide::CHEMBL192834
SMILES CN(C)c1nc(NCc2ccc(cc2)S(N)(=O)=O)nc(n1)N(C)C
InChI Key InChIKey=LBPUEESNXASXDT-UHFFFAOYSA-N
Data  3 KI
  Tab Delimited (TSV)   2D SDfile   Computed 3D by Vconf -m prep SDfile
Find this compound or compounds like it in BindingDB:
Activity Spreadsheet -- Enzyme Inhibition Constant Data from BindingDB
Found 3 hits for monomerid = 50167350
TargetCarbonic anhydrase 9(Homo sapiens (Human))
Universit£
Curated by ChEMBL
LigandPNGBDBM50167350(4-[(4,6-Bis-dimethylamino-[1,3,5]triazin-2-ylamino...)
Affinity DataKi:  1.30nM. Assay description: Inhibitory constant against human Carbonic anhydrase IX
In DepthDetails ArticlePubMed
TargetCarbonic anhydrase 2(Homo sapiens (Human))
Universit£
Curated by ChEMBL
LigandPNGBDBM50167350(4-[(4,6-Bis-dimethylamino-[1,3,5]triazin-2-ylamino...)
Affinity DataKi:  33nM. Assay description: Inhibitory constant against human Carbonic anhydrase II
In DepthDetails ArticlePubMed
TargetCarbonic anhydrase 1(Homo sapiens (Human))
Universit£
Curated by ChEMBL
LigandPNGBDBM50167350(4-[(4,6-Bis-dimethylamino-[1,3,5]triazin-2-ylamino...)
Affinity DataKi:  75nM. Assay description: Inhibitory constant against human Carbonic anhydrase I
In DepthDetails ArticlePubMed