BDBM50167428 CHEMBL3797264
SMILES COc1cccc(Oc2cccc(N3CCCCC3)c2CN\C(N)=N\C(=O)c2ccc(C[C@H](N)C(O)=O)cc2)c1
InChI Key InChIKey=UDMPHIGEFLMAIW-VWLOTQADSA-N
Data  1 IC50
  Tab Delimited (TSV)   2D SDfile   Computed 3D by Vconf -m prep SDfile
Find this compound or compounds like it in BindingDB:
Activity Spreadsheet -- Enzyme Inhibition Constant Data from BindingDB
Found 1 hit for monomerid = 50167428
TargetTryptophan 5-hydroxylase 1(Homo sapiens (Human))
Karos Pharmaceuticals
Curated by ChEMBL
LigandPNGBDBM50167428(CHEMBL3797264)
Affinity DataIC50:  6nM. Assay description: Inhibition of TPH1 (unknown origin)
In DepthDetails ArticlePubMed